Reaction Details
TargetExtracellular calcium-sensing receptor
LigandBDBM50325491
Substrate/Competitorn/a
Meas. Tech.ChEMBL_652215 (CHEMBL1228488)
IC50 4690±n/a nM
Citation Gerspacher, MAltmann, EBeerli, RBuhl, TEndres, RGamse, RKameni-Tcheudji, JKneissel, MKrawinkler, KHMissbach, MSchmidt, ASeuwen, KWeiler, SWidler, L Penta-substituted benzimidazoles as potent antagonists of the calcium-sensing receptor (CaSR-antagonists). Bioorg Med Chem Lett20:5161-4 (2010) 
 
Extracellular calcium-sensing receptor
Name:Extracellular calcium-sensing receptor
Type:Protein
Mol. Mass.:120663.13
Organism:Homo sapiens (Human)
Description:P41180
Residue:1078
BDBM50325491
NameBDBM50325491
Synonyms:1-butyl-2-(4-isopropylphenyl)-4-methoxy-1H-benzo[d]imidazole | CHEMBL1223298
TypeSmall organic molecule
Emp. Form.C21H26N2O
Mol. Mass.322.4439
SMILESCCCCn1c(nc2c(OC)cccc12)-c1ccc(cc1)C(C)C