Reaction Details
TargetExtracellular calcium-sensing receptor
LigandBDBM50325506
Substrate/Competitorn/a
Meas. Tech.ChEMBL_652215 (CHEMBL1228488)
IC50>10000±n/a nM
Citation Gerspacher, MAltmann, EBeerli, RBuhl, TEndres, RGamse, RKameni-Tcheudji, JKneissel, MKrawinkler, KHMissbach, MSchmidt, ASeuwen, KWeiler, SWidler, L Penta-substituted benzimidazoles as potent antagonists of the calcium-sensing receptor (CaSR-antagonists). Bioorg Med Chem Lett20:5161-4 (2010) 
 
Extracellular calcium-sensing receptor
Name:Extracellular calcium-sensing receptor
Type:Protein
Mol. Mass.:120663.13
Organism:Homo sapiens (Human)
Description:P41180
Residue:1078
BDBM50325506
NameBDBM50325506
Synonyms:2-(4-bromo-2-(4-isopropylphenyl)-7-methoxy-1H-benzo[d]imidazol-1-yl)-N,N-dimethylacetamide | CHEMBL1223441
TypeSmall organic molecule
Emp. Form.C21H24BrN3O2
Mol. Mass.430.338
SMILESCOc1ccc(Br)c2nc(-c3ccc(cc3)C(C)C)n(CC(=O)N(C)C)c12