Reaction Details
TargetKappa-type opioid receptor
LigandBDBM50325526
Substrate/Competitorn/a
Meas. Tech.ChEMBL_652217 (CHEMBL1228490)
Ki 0.935±n/a nM
Citation Fujii, HIda, YHanamura, SOsa, YNemoto, TNakajima, MHasebe, KNakao, KMochizuki, HNagase, H Synthesis of pyrrolomorphinan derivatives as kappa opioid agonists. Bioorg Med Chem Lett20:5035-8 (2010) 
 
Kappa-type opioid receptor
Name:Kappa-type opioid receptor
Type:G Protein-Coupled Receptor (GPCR)
Mol. Mass.:42744.99
Organism:Cavia porcellus (domestic guinea pig)
Description:P41144
Residue:380
BDBM50325526
NameBDBM50325526
Synonyms:CHEMBL1223773
TypeSmall organic molecule
Emp. Form.C34H36N2O4
Mol. Mass.536.6606
SMILESCn1c(C=CC(=O)CCc2ccccc2)cc2C[C@@]3(O)[C@H]4Cc5ccc(O)c6O[C@@H](c12)[C@]3(CCN4CC1CC1)c56