Reaction Details
TargetKappa-type opioid receptor
LigandBDBM50325529
Substrate/Competitorn/a
Meas. Tech.ChEMBL_652217 (CHEMBL1228490)
Ki 1.15±n/a nM
Citation Fujii, HIda, YHanamura, SOsa, YNemoto, TNakajima, MHasebe, KNakao, KMochizuki, HNagase, H Synthesis of pyrrolomorphinan derivatives as kappa opioid agonists. Bioorg Med Chem Lett20:5035-8 (2010) 
 
Kappa-type opioid receptor
Name:Kappa-type opioid receptor
Type:G Protein-Coupled Receptor (GPCR)
Mol. Mass.:42744.99
Organism:Cavia porcellus (domestic guinea pig)
Description:P41144
Residue:380
BDBM50325529
NameBDBM50325529
Synonyms:CHEMBL1223832
TypeSmall organic molecule
Emp. Form.C31H32N2O5
Mol. Mass.512.5962
SMILESCc1occc1C(=O)C=Cc1cc2C[C@@]3(O)[C@H]4Cc5ccc(O)c6O[C@@H](c2n1C)[C@]3(CCN4CC1CC1)c56