Reaction Details
TargetMu-type opioid receptor
LigandBDBM50325533
Substrate/Competitorn/a
Meas. Tech.ChEMBL_652218 (CHEMBL1228491)
Ki 5.85±n/a nM
Citation Fujii, HIda, YHanamura, SOsa, YNemoto, TNakajima, MHasebe, KNakao, KMochizuki, HNagase, H Synthesis of pyrrolomorphinan derivatives as kappa opioid agonists. Bioorg Med Chem Lett20:5035-8 (2010) 
 
Mu-type opioid receptor
Name:Mu-type opioid receptor
Type:Enzyme Catalytic Domain
Mol. Mass.:11165.58
Organism:GUINEA PIG
Description:P97266
Residue:98
BDBM50325533
NameBDBM50325533
Synonyms:CHEMBL1223890
TypeSmall organic molecule
Emp. Form.C28H34N2O3
Mol. Mass.446.5812
SMILESCCC\C=C\c1cc2C[C@@]3(O)[C@H]4Cc5ccc(O)c6O[C@@H](c2n1C)[C@]3(CCN4CC1CC1)c56