Reaction Details
TargetCannabinoid receptor 1
LigandBDBM50325578
Substrate/Competitorn/a
Meas. Tech.ChEMBL_652250 (CHEMBL1225453)
Ki 19.3±n/a nM
Citation Lange, JHAttali, Avan der Neut, MAWals, HCMulder, AZilaout, HDuursma, Avan Aken, HHvan Vliet, BJ Two distinct classes of novel pyrazolinecarboxamides as potent cannabinoid CB1 receptor agonists. Bioorg Med Chem Lett20:4992-8 (2010) 
 
Cannabinoid receptor 1
Name:Cannabinoid receptor 1
Type:G Protein-Coupled Receptor (GPCR)
Mol. Mass.:52868.96
Organism:Homo sapiens (Human)
Description:P21554
Residue:472
BDBM50325578
NameBDBM50325578
Synonyms:3-butyl-N-(2-phenylpropan-2-yl)-4-(thiophen-3-yl)-4,5-dihydro-1H-pyrazole-1-carboxamide | CHEMBL1223592
TypeSmall organic molecule
Emp. Form.C21H27N3OS
Mol. Mass.369.524
SMILESCCCCC1=NN(CC1c1ccsc1)C(=O)NC(C)(C)c1ccccc1