Reaction Details
TargetCannabinoid receptor 1
LigandBDBM50325582
Substrate/Competitorn/a
Meas. Tech.ChEMBL_652250 (CHEMBL1225453)
Ki 33.1±n/a nM
Citation Lange, JHAttali, Avan der Neut, MAWals, HCMulder, AZilaout, HDuursma, Avan Aken, HHvan Vliet, BJ Two distinct classes of novel pyrazolinecarboxamides as potent cannabinoid CB1 receptor agonists. Bioorg Med Chem Lett20:4992-8 (2010) 
 
Cannabinoid receptor 1
Name:Cannabinoid receptor 1
Type:G Protein-Coupled Receptor (GPCR)
Mol. Mass.:52868.96
Organism:Homo sapiens (Human)
Description:P21554
Residue:472
BDBM50325582
NameBDBM50325582
Synonyms:3-pentyl-4-phenyl-N-(1,2,3,4-tetrahydronaphthalen-1-yl)-4,5-dihydro-1H-pyrazole-1-carboxamide | CHEMBL1223649
TypeSmall organic molecule
Emp. Form.C25H31N3O
Mol. Mass.389.5331
SMILESCCCCCC1=NN(CC1c1ccccc1)C(=O)NC1CCCc2ccccc12