Reaction Details
TargetCannabinoid receptor 1
LigandBDBM50325585
Substrate/Competitorn/a
Meas. Tech.ChEMBL_652250 (CHEMBL1225453)
Ki 164±n/a nM
Citation Lange, JHAttali, Avan der Neut, MAWals, HCMulder, AZilaout, HDuursma, Avan Aken, HHvan Vliet, BJ Two distinct classes of novel pyrazolinecarboxamides as potent cannabinoid CB1 receptor agonists. Bioorg Med Chem Lett20:4992-8 (2010) 
 
Cannabinoid receptor 1
Name:Cannabinoid receptor 1
Type:G Protein-Coupled Receptor (GPCR)
Mol. Mass.:52868.96
Organism:Homo sapiens (Human)
Description:P21554
Residue:472
BDBM50325585
NameBDBM50325585
Synonyms:CHEMBL1223715 | naphthalen-1-yl(3-pentyl-4-phenyl-4,5-dihydro-1H-pyrazol-1-yl)methanone
TypeSmall organic molecule
Emp. Form.C25H26N2O
Mol. Mass.370.4867
SMILESCCCCCC1=NN(CC1c1ccccc1)C(=O)c1cccc2ccccc12