Reaction Details
TargetCannabinoid receptor 1
LigandBDBM50325598
Substrate/Competitorn/a
Meas. Tech.ChEMBL_652250 (CHEMBL1225453)
Ki 68±n/a nM
Citation Lange, JHAttali, Avan der Neut, MAWals, HCMulder, AZilaout, HDuursma, Avan Aken, HHvan Vliet, BJ Two distinct classes of novel pyrazolinecarboxamides as potent cannabinoid CB1 receptor agonists. Bioorg Med Chem Lett20:4992-8 (2010) 
 
Cannabinoid receptor 1
Name:Cannabinoid receptor 1
Type:G Protein-Coupled Receptor (GPCR)
Mol. Mass.:52868.96
Organism:Homo sapiens (Human)
Description:P21554
Residue:472
BDBM50325598
NameBDBM50325598
Synonyms:3-Pentyl-4-phenyl-4,5-dihydro-pyraz ole-1-carboxylic acid adamantan-1-y lamide | CHEMBL1224629
TypeSmall organic molecule
Emp. Form.C25H35N3O
Mol. Mass.393.5649
SMILESCCCCCC1=NN(CC1c1ccccc1)C(=O)NC12CC3CC(CC(C3)C1)C2