Reaction Details
TargetCannabinoid receptor 1
LigandBDBM50325599
Substrate/Competitorn/a
Meas. Tech.ChEMBL_652250 (CHEMBL1225453)
Ki 3.26±n/a nM
Citation Lange, JHAttali, Avan der Neut, MAWals, HCMulder, AZilaout, HDuursma, Avan Aken, HHvan Vliet, BJ Two distinct classes of novel pyrazolinecarboxamides as potent cannabinoid CB1 receptor agonists. Bioorg Med Chem Lett20:4992-8 (2010) 
 
Cannabinoid receptor 1
Name:Cannabinoid receptor 1
Type:G Protein-Coupled Receptor (GPCR)
Mol. Mass.:52868.96
Organism:Homo sapiens (Human)
Description:P21554
Residue:472
BDBM50325599
NameBDBM50325599
Synonyms:3-Pentyl-4-phenyl-4,5-dihydro-pyrazole-1-carboxylic acid(1-methyl-1-phenyl-ethyl)-amide | CHEMBL1224691
TypeSmall organic molecule
Emp. Form.C24H31N3O
Mol. Mass.377.5224
SMILESCCCCCC1=NN(CC1c1ccccc1)C(=O)NC(C)(C)c1ccccc1