Reaction Details
TargetNeuropeptide Y receptor type 1
LigandBDBM50325601
Substrate/Competitorn/a
Meas. Tech.ChEMBL_652269 (CHEMBL1225472)
Ki 460±n/a nM
Citation Weiss, SKeller, MBernhardt, GBuschauer, AKönig, B N(G)-Acyl-argininamides as NPY Y(1) receptor antagonists: Influence of structurally diverse acyl substituents on stability and affinity. Bioorg Med Chem18:6292-304 (2010) 
 
Neuropeptide Y receptor type 1
Name:Neuropeptide Y receptor type 1
Type:Enzyme Catalytic Domain
Mol. Mass.:44399.07
Organism:Homo sapiens (Human)
Description:NPY-Y1 NPY1R HUMAN::P25929
Residue:384
BDBM50325601
NameBDBM50325601
Synonyms:(R)-N-(N-(4-(2,2-diphenylacetamido)-5-(4-hydroxybenzylamino)-5-oxopentyl)carbamimidoyl)palmitamide | CHEMBL1223987
TypeSmall organic molecule
Emp. Form.C43H61N5O4
Mol. Mass.711.9755
(=O)NC(N)=NCCC[C@@H](NC(=O)C(c1ccccc1)c1ccccc1)C(=O)NCc1ccc(O)cc1