Reaction Details
TargetNeuropeptide Y receptor type 1
LigandBDBM50325608
Substrate/Competitorn/a
Meas. Tech.ChEMBL_652269 (CHEMBL1225472)
Ki 3±n/a nM
Citation Weiss, SKeller, MBernhardt, GBuschauer, AKönig, B N(G)-Acyl-argininamides as NPY Y(1) receptor antagonists: Influence of structurally diverse acyl substituents on stability and affinity. Bioorg Med Chem18:6292-304 (2010) 
 
Neuropeptide Y receptor type 1
Name:Neuropeptide Y receptor type 1
Type:Enzyme Catalytic Domain
Mol. Mass.:44399.07
Organism:Homo sapiens (Human)
Description:NPY-Y1 NPY1R HUMAN::P25929
Residue:384
BDBM50325608
NameBDBM50325608
Synonyms:(R)-1-[4-(2,2-Diphenylacetamido)-5-(4-hydroxybenzylamino)-5-oxopentyl]-2-{4-[4-(hydroxymethyl)-1H-1,2,3-triazol-1-yl]butanoyl}guanidinium 2,2,2-trifluoroacetate | CHEMBL1223996
TypeSmall organic molecule
Emp. Form.C34H40N8O5
Mol. Mass.640.732
SMILESNC(NC(=O)CCCn1cc(CO)nn1)=NCCC[C@@H](NC(=O)C(c1ccccc1)c1ccccc1)C(=O)NCc1ccc(O)cc1