Reaction Details
TargetNeuropeptide Y receptor type 1
LigandBDBM50325609
Substrate/Competitorn/a
Meas. Tech.ChEMBL_652269 (CHEMBL1225472)
Ki 6.7±n/a nM
Citation Weiss, SKeller, MBernhardt, GBuschauer, AKönig, B N(G)-Acyl-argininamides as NPY Y(1) receptor antagonists: Influence of structurally diverse acyl substituents on stability and affinity. Bioorg Med Chem18:6292-304 (2010) 
 
Neuropeptide Y receptor type 1
Name:Neuropeptide Y receptor type 1
Type:Enzyme Catalytic Domain
Mol. Mass.:44399.07
Organism:Homo sapiens (Human)
Description:NPY-Y1 NPY1R HUMAN::P25929
Residue:384
BDBM50325609
NameBDBM50325609
Synonyms:(R)-2-{4-[4-(Ammoniomethyl)-1H-1,2,3-triazol-1-yl]butanoyl}-1-[4-(2,2-diphenylacetamido)-5-(4-hydroxybenzylamino)-5-oxopentyl]guanidinium 2,2,2-trifluoroacetate | CHEMBL1223997
TypeSmall organic molecule
Emp. Form.C34H41N9O4
Mol. Mass.639.7472
SMILESNCc1cn(CCCC(=O)NC(N)=NCCC[C@@H](NC(=O)C(c2ccccc2)c2ccccc2)C(=O)NCc2ccc(O)cc2)nn1