Reaction Details
TargetProstaglandin G/H synthase 1
LigandBDBM50325645
Substrate/Competitorn/a
Meas. Tech.ChEMBL_652314 (CHEMBL1225517)
IC50 61±n/a nM
Citation Eren, GUnlü, SNuñez, MTLabeaga, LLedo, FEntrena, ABanoglu, ECostantino, GSahin, MF Synthesis, biological evaluation, and docking studies of novel heterocyclic diaryl compounds as selective COX-2 inhibitors. Bioorg Med Chem18:6367-76 (2010) 
 
Prostaglandin G/H synthase 1
Name:Prostaglandin G/H synthase 1
Type:Protein
Mol. Mass.:68868.60
Organism:Ovis aries (Sheep)
Description:n/a
Residue:600
BDBM50325645
NameBDBM50325645
Synonyms:3-(4-Methoxyphenyl)-4-(3-methyl-2-oxo-3H-benzoxazole-6-yl)-2-oxo-5H-furane | CHEMBL1223901
TypeSmall organic molecule
Emp. Form.C19H15NO5
Mol. Mass.337.3261
SMILESCOc1ccc(cc1)C1=C(COC1=O)c1ccc2n(C)c(=O)oc2c1