Reaction Details
TargetProstaglandin G/H synthase 1
LigandBDBM50325646
Substrate/Competitorn/a
Meas. Tech.ChEMBL_652314 (CHEMBL1225517)
IC50 4±n/a nM
Citation Eren, GUnlü, SNuñez, MTLabeaga, LLedo, FEntrena, ABanoglu, ECostantino, GSahin, MF Synthesis, biological evaluation, and docking studies of novel heterocyclic diaryl compounds as selective COX-2 inhibitors. Bioorg Med Chem18:6367-76 (2010) 
 
Prostaglandin G/H synthase 1
Name:Prostaglandin G/H synthase 1
Type:Protein
Mol. Mass.:68868.60
Organism:Ovis aries (Sheep)
Description:n/a
Residue:600
BDBM50325646
NameBDBM50325646
Synonyms:1-(4-Methoxyphenyl)-3-trifluoromethyl-5-(3-methyl-2-oxo-3H-benzoxazole-6-yl)-1H-pyrazole | CHEMBL1224097
TypeSmall organic molecule
Emp. Form.C19H14F3N3O3
Mol. Mass.389.328
SMILESCOc1ccc(cc1)-n1nc(cc1-c1ccc2n(C)c(=O)oc2c1)C(F)(F)F