Reaction Details
TargetCysteine protease
LigandBDBM50325650
Substrate/Competitorn/a
Meas. Tech.ChEMBL_652322 (CHEMBL1225525)
Ki 360±n/a nM
Citation Waag, TGelhaus, CRath, JStich, ALeippe, MSchirmeister, T Allicin and derivates are cysteine protease inhibitors with antiparasitic activity. Bioorg Med Chem Lett20:5541-3 (2010) 
 
Cysteine protease
Name:Cysteine protease
Synonyms:Rhodesain
Type:PROTEIN
Mol. Mass.:48425.78
Organism:Trypanosoma brucei rhodesiense
Description:ChEMBL_619861
Residue:450
BDBM50325650
NameBDBM50325650
TypeSmall organic molecule
Emp. Form.C10H22OS2
Mol. Mass.222.411
SMILESCC(C)CCSS(=O)CCC(C)C