Reaction Details
TargetCytochrome P450 1A1
LigandBDBM50084978
Substrate/Competitorn/a
Meas. Tech.ChEMBL_652514 (CHEMBL1225717)
IC50 88±n/a nM
Citation Takemura, HItoh, TYamamoto, KSakakibara, HShimoi, K Selective inhibition of methoxyflavonoids on human CYP1B1 activity. Bioorg Med Chem18:6310-5 (2010) 
 
Cytochrome P450 1A1
Name:Cytochrome P450 1A1
Type:Protein
Mol. Mass.:58177.23
Organism:Homo sapiens (Human)
Description:P04798
Residue:512
BDBM50084978
NameBDBM50084978
Synonyms:3,5,7-trihydroxy-2-(4-methoxyphenyl)-4H-chromen-4-one Kaempferide | Kaempferol 4'-methyl ether
TypeSmall organic molecule
Emp. Form.C16H12O6
Mol. Mass.300.2629
SMILESCOc1ccc(cc1)-c1oc2cc(O)cc(O)c2c(=O)c1O