Reaction Details
TargetCytochrome P450 1B1
LigandBDBM23414
Substrate/Competitorn/a
Meas. Tech.ChEMBL_652515 (CHEMBL1225718)
IC50 29±n/a nM
Citation Takemura, HItoh, TYamamoto, KSakakibara, HShimoi, K Selective inhibition of methoxyflavonoids on human CYP1B1 activity. Bioorg Med Chem18:6310-5 (2010) 
 
Cytochrome P450 1B1
Name:Cytochrome P450 1B1
Type:PROTEIN
Mol. Mass.:60861.81
Organism:Homo sapiens (Human)
Description:ChEMBL_1474523
Residue:543
BDBM23414
NameBDBM23414
Synonyms:5,7-dihydroxy-2-(3-hydroxy-4-methoxyphenyl)-4H-chromen-4-one Diosmetin (25)
Typeflavone
Emp. Form.C16H12O6
Mol. Mass.300.2629
SMILESCOc1ccc(cc1O)-c1cc(=O)c2c(O)cc(O)cc2o1