Reaction Details
TargetSialidase
LigandBDBM50241453
Substrate/Competitorn/a
Meas. Tech.ChEMBL_652518 (CHEMBL1225721)
IC50 2200±n/a nM
Citation Ryu, HWCurtis-Long, MJJung, SJin, YMCho, JKRyu, YBLee, WSPark, KH Xanthones with neuraminidase inhibitory activity from the seedcases of Garcinia mangostana. Bioorg Med Chem18:6258-64 (2010) 
 
Sialidase
Name:Sialidase
Type:PROTEIN
Mol. Mass.:42808.79
Organism:Clostridium perfringens
Description:ChEMBL_991336
Residue:382
BDBM50241453
NameBDBM50241453
Synonyms:1,3,6,7-tetrahydroxy-2,8-bis(3-methylbut-2-enyl)-9H-xanthen-9-one gamma-mangostin
TypeSmall organic molecule
Emp. Form.C23H24O6
Mol. Mass.396.4331
SMILES[#6]\[#6](-[#6])=[#6]\[#6]-c1c(-[#8])cc2oc3cc(-[#8])c(-[#8])c(-[#6]\[#6]=[#6](\[#6])-[#6])c3c(=O)c2c1-[#8]