Reaction Details
TargetSialidase
LigandBDBM50311741
Substrate/Competitorn/a
Meas. Tech.ChEMBL_652516 (CHEMBL1225719)
Ki 5900±n/a nM
Citation Ryu, HWCurtis-Long, MJJung, SJin, YMCho, JKRyu, YBLee, WSPark, KH Xanthones with neuraminidase inhibitory activity from the seedcases of Garcinia mangostana. Bioorg Med Chem18:6258-64 (2010) 
 
Sialidase
Name:Sialidase
Type:PROTEIN
Mol. Mass.:42808.79
Organism:Clostridium perfringens
Description:ChEMBL_991336
Residue:382
BDBM50311741
NameBDBM50311741
Synonyms:1,6-dihydroxy-7-methoxy-8-(3-methylbut-2-enyl)-6',6'-dimethylpyrano(2',3':3,2)xanthone CHEMBL561643 | mangostanin
TypeSmall organic molecule
Emp. Form.C24H24O6
Mol. Mass.408.4438
SMILES[#6]-[#8]-c1c(-[#8])cc2oc3cc4-[#8]C([#6])([#6])[#6]=[#6]-c4c(-[#8])c3c(=O)c2c1-[#6]\[#6]=[#6](\[#6])-[#6]