Reaction Details
TargetSialidase
LigandBDBM50325675
Substrate/Competitorn/a
Meas. Tech.ChEMBL_652516 (CHEMBL1225719)
Ki 150±n/a nM
Citation Ryu, HWCurtis-Long, MJJung, SJin, YMCho, JKRyu, YBLee, WSPark, KH Xanthones with neuraminidase inhibitory activity from the seedcases of Garcinia mangostana. Bioorg Med Chem18:6258-64 (2010) 
 
Sialidase
Name:Sialidase
Type:PROTEIN
Mol. Mass.:42808.79
Organism:Clostridium perfringens
Description:ChEMBL_991336
Residue:382
BDBM50325675
NameBDBM50325675
Synonyms:CHEMBL480158 | smeathxanthone A
TypeSmall organic molecule
Emp. Form.C23H24O6
Mol. Mass.396.4331
SMILES[#6]\[#6](-[#6])=[#6]\[#6]-[#6]\[#6](-[#6])=[#6]\[#6]-c1c(-[#8])cc2oc3c(-[#8])ccc(-[#8])c3c(=O)c2c1-[#8]