Reaction Details
TargetExtracellular calcium-sensing receptor
LigandBDBM50325737
Substrate/Competitorn/a
Meas. Tech.ChEMBL_652596 (CHEMBL1225799)
EC50 430±n/a nM
Citation Harrington, PESt Jean, DJClarine, JCoulter, TSCroghan, MDavenport, ADavis, JGhiron, CHutchinson, JKelly, MGLott, FLu, JYMartin, DMorony, SPoon, SFPortero-Larragueta, EReagan, JDRegal, KATasker, AWang, MYang, YYao, GZeng, QHenley, CFotsch, C The discovery of an orally efficacious positive allosteric modulator of the calcium sensing receptor containing a dibenzylamine core. Bioorg Med Chem Lett20:5544-7 (2010) 
 
Extracellular calcium-sensing receptor
Name:Extracellular calcium-sensing receptor
Type:Protein
Mol. Mass.:120663.13
Organism:Homo sapiens (Human)
Description:P41180
Residue:1078
BDBM50325737
NameBDBM50325737
Synonyms:CHEMBL1224343 | N-((6-methoxy-4'-(trifluoromethyl)biphenyl-3-yl)methyl)-1-m-tolylethanamine
TypeSmall organic molecule
Emp. Form.C24H24F3NO
Mol. Mass.399.4487
SMILESCOc1ccc(CNC(C)c2cccc(C)c2)cc1-c1ccc(cc1)C(F)(F)F