Reaction Details
TargetExtracellular calcium-sensing receptor
LigandBDBM50325725
Substrate/Competitorn/a
Meas. Tech.ChEMBL_652596 (CHEMBL1225799)
EC50>5000±n/a nM
Citation Harrington, PESt Jean, DJClarine, JCoulter, TSCroghan, MDavenport, ADavis, JGhiron, CHutchinson, JKelly, MGLott, FLu, JYMartin, DMorony, SPoon, SFPortero-Larragueta, EReagan, JDRegal, KATasker, AWang, MYang, YYao, GZeng, QHenley, CFotsch, C The discovery of an orally efficacious positive allosteric modulator of the calcium sensing receptor containing a dibenzylamine core. Bioorg Med Chem Lett20:5544-7 (2010) 
 
Extracellular calcium-sensing receptor
Name:Extracellular calcium-sensing receptor
Type:Protein
Mol. Mass.:120663.13
Organism:Homo sapiens (Human)
Description:P41180
Residue:1078
BDBM50325725
NameBDBM50325725
Synonyms:(R)-N-benzyl-1-(3-methoxyphenyl)ethanamine | CHEMBL1224190
TypeSmall organic molecule
Emp. Form.C16H19NO
Mol. Mass.241.3282
SMILESCOc1cccc(c1)[C@@H](C)NCc1ccccc1