Reaction Details
TargetExtracellular calcium-sensing receptor
LigandBDBM50325732
Substrate/Competitorn/a
Meas. Tech.ChEMBL_652596 (CHEMBL1225799)
EC50>5000±n/a nM
Citation Harrington, PESt Jean, DJClarine, JCoulter, TSCroghan, MDavenport, ADavis, JGhiron, CHutchinson, JKelly, MGLott, FLu, JYMartin, DMorony, SPoon, SFPortero-Larragueta, EReagan, JDRegal, KATasker, AWang, MYang, YYao, GZeng, QHenley, CFotsch, C The discovery of an orally efficacious positive allosteric modulator of the calcium sensing receptor containing a dibenzylamine core. Bioorg Med Chem Lett20:5544-7 (2010) 
 
Extracellular calcium-sensing receptor
Name:Extracellular calcium-sensing receptor
Type:Protein
Mol. Mass.:120663.13
Organism:Homo sapiens (Human)
Description:P41180
Residue:1078
BDBM50325732
NameBDBM50325732
Synonyms:(R)-N-((4'-methoxybiphenyl-3-yl)methyl)-1-(3-methoxyphenyl)ethanamine | CHEMBL1224263
TypeSmall organic molecule
Emp. Form.C23H25NO2
Mol. Mass.347.4501
SMILESCOc1ccc(cc1)-c1cccc(CN[C@H](C)c2cccc(OC)c2)c1