Reaction Details
TargetSodium channel protein type 9 subunit alpha
LigandBDBM50325764
Substrate/Competitorn/a
Meas. Tech.ChEMBL_652886 (CHEMBL1226089)
IC50 15±n/a nM
Citation Tyagarajan, SChakravarty, PKZhou, BFisher, MHWyvratt, MJLyons, KKlatt, TLi, XKumar, SWilliams, BFelix, JPriest, BTBrochu, RMWarren, VSmith, MGarcia, MKaczorowski, GJMartin, WJAbbadie, CMcGowan, EJochnowitz, NParsons, WH Substituted biaryl oxazoles, imidazoles, and thiazoles as sodium channel blockers. Bioorg Med Chem Lett20:5536-40 (2010) 
 
Sodium channel protein type 9 subunit alpha
Name:Sodium channel protein type 9 subunit alpha
Type:Protein
Mol. Mass.:226375.97
Organism:Homo sapiens (Human)
Description:Q15858
Residue:1988
BDBM50325764
NameBDBM50325764
Synonyms:4-(2'-(trifluoromethoxy)biphenyl-3-yl)thiazole-2-carboxamide | CHEMBL1224197
TypeSmall organic molecule
Emp. Form.C17H11F3N2O2S
Mol. Mass.364.342
SMILESNC(=O)c1nc(cs1)-c1cccc(c1)-c1ccccc1OC(F)(F)F