Reaction Details
TargetD(1A) dopamine receptor
LigandBDBM50325822
Substrate/Competitorn/a
Meas. Tech.ChEMBL_652919 (CHEMBL1226122)
EC50 0.640000±n/a nM
Citation Bonner, LAChemel, BRWatts, VJNichols, DE Facile synthesis of octahydrobenzo[h]isoquinolines: novel and highly potent D1 dopamine agonists. Bioorg Med Chem18:6763-70 (2010) 
 
D(1A) dopamine receptor
Name:D(1A) dopamine receptor
Type:Enzyme
Mol. Mass.:49303.43
Organism:Homo sapiens (Human)
Description:P21728
Residue:446
BDBM50325822
NameBDBM50325822
Synonyms:CHEMBL1224527 | trans-(5R)-5-phenyl-1,2,3,4,4a,5,6,10b-octahydrobenzo[h]isoquinoline-7,8-diol
TypeSmall organic molecule
Emp. Form.C19H21NO2
Mol. Mass.295.3755
SMILESOc1ccc2[C@@H]3CNCC[C@H]3[C@@H](Cc2c1O)c1ccccc1