Reaction Details
TargetDelta-type opioid receptor
LigandBDBM50325848
Substrate/Competitorn/a
Meas. Tech.ChEMBL_652660 (CHEMBL1225863)
IC50 8306±n/a nM
Citation Brugel, TASmith, RWBalestra, MBecker, CDaniels, TKoether, GMThroner, SRPanko, LMBrown, DGLiu, RGordon, JPeters, MF SAR development of a series of 8-azabicyclo[3.2.1]octan-3-yloxy-benzamides as kappa opioid receptor antagonists. Part 2. Bioorg Med Chem Lett20:5405-10 (2010) 
 
Delta-type opioid receptor
Name:Delta-type opioid receptor
Type:G Protein-Coupled Receptor (GPCR)
Mol. Mass.:40382.98
Organism:Homo sapiens (Human)
Description:Competition binding assays were carried out using membrane preparations from transfected HN9.10 cells that constitutively expressed the delta opioid receptor.
Residue:372
BDBM50325848
NameBDBM50325848
Synonyms:8-azabicyclo[3.2.1]octan-3-yloxy-benzamide | CHEMBL1223815
TypeSmall organic molecule
Emp. Form.C20H24N2O2S
Mol. Mass.356.482
SMILESCc1ccc(CN2[C@H]3CC[C@@H]2C[C@@H](C3)Oc2cccc(c2)C(N)=O)s1