Reaction Details
TargetDelta-type opioid receptor
LigandBDBM50325860
Substrate/Competitorn/a
Meas. Tech.ChEMBL_652660 (CHEMBL1225863)
IC50 14697±n/a nM
Citation Brugel, TASmith, RWBalestra, MBecker, CDaniels, TKoether, GMThroner, SRPanko, LMBrown, DGLiu, RGordon, JPeters, MF SAR development of a series of 8-azabicyclo[3.2.1]octan-3-yloxy-benzamides as kappa opioid receptor antagonists. Part 2. Bioorg Med Chem Lett20:5405-10 (2010) 
 
Delta-type opioid receptor
Name:Delta-type opioid receptor
Type:G Protein-Coupled Receptor (GPCR)
Mol. Mass.:40382.98
Organism:Homo sapiens (Human)
Description:Competition binding assays were carried out using membrane preparations from transfected HN9.10 cells that constitutively expressed the delta opioid receptor.
Residue:372
BDBM50325860
NameBDBM50325860
Synonyms:CHEMBL1224065 | endo-3-((1R,5S)-8-benzyl-8-azabicyclo[3.2.1]octan-3-ylamino)benzamide
TypeSmall organic molecule
Emp. Form.C21H25N3O
Mol. Mass.335.4427
SMILESNC(=O)c1cccc(N[C@@H]2C[C@@H]3CC[C@H](C2)N3Cc2ccccc2)c1