Reaction Details
TargetPotassium voltage-gated channel subfamily H member 2
LigandBDBM50325869
Substrate/Competitorn/a
Meas. Tech.ChEMBL_652661 (CHEMBL1225864)
IC50 1100±n/a nM
Citation Brugel, TASmith, RWBalestra, MBecker, CDaniels, TKoether, GMThroner, SRPanko, LMBrown, DGLiu, RGordon, JPeters, MF SAR development of a series of 8-azabicyclo[3.2.1]octan-3-yloxy-benzamides as kappa opioid receptor antagonists. Part 2. Bioorg Med Chem Lett20:5405-10 (2010) 
 
Potassium voltage-gated channel subfamily H member 2
Name:Potassium voltage-gated channel subfamily H member 2
Type:Multi-pass membrane protein
Mol. Mass.:126672.65
Organism:Homo sapiens (Human)
Description:Q12809
Residue:1159
BDBM50325869
NameBDBM50325869
Synonyms:CHEMBL1224142 | endo-3-((1R,5S)-8-benzyl-8-azabicyclo[3.2.1]octan-3-yloxy)-2-methylbenzamide
TypeSmall organic molecule
Emp. Form.C22H26N2O2
Mol. Mass.350.454
SMILESCc1c(O[C@@H]2C[C@@H]3CC[C@H](C2)N3Cc2ccccc2)cccc1C(N)=O