Reaction Details
TargetCannabinoid receptor 1
LigandBDBM50325882
Substrate/Competitorn/a
Meas. Tech.ChEMBL_652678 (CHEMBL1225881)
IC50 21±n/a nM
Citation Letourneau, JJJokiel, POlson, JRiviello, CMHo, KKMcAleer, LYang, JSwanson, RNBaker, JCowley, PEdwards, DWard, NOhlmeyer, MHWebb, ML Identification and hit-to-lead optimization of a novel class of CB1 antagonists. Bioorg Med Chem Lett20:5449-53 (2010) 
 
Cannabinoid receptor 1
Name:Cannabinoid receptor 1
Type:G Protein-Coupled Receptor (GPCR)
Mol. Mass.:52868.96
Organism:Homo sapiens (Human)
Description:P21554
Residue:472
BDBM50325882
NameBDBM50325882
Synonyms:CHEMBL1224373 | N-(1-((6-(benzo[d][1,3]dioxol-4-yl)pyridin-2-yl)methyl)-1H-benzo[d]imidazol-6-yl)pivalamide
TypeSmall organic molecule
Emp. Form.C25H24N4O3
Mol. Mass.428.4831
SMILESCC(C)(C)C(=O)Nc1ccc2ncn(Cc3cccc(n3)-c3cccc4OCOc34)c2c1