Reaction Details
TargetCannabinoid receptor 1
LigandBDBM50325884
Substrate/Competitorn/a
Meas. Tech.ChEMBL_652678 (CHEMBL1225881)
IC50 51±n/a nM
Citation Letourneau, JJJokiel, POlson, JRiviello, CMHo, KKMcAleer, LYang, JSwanson, RNBaker, JCowley, PEdwards, DWard, NOhlmeyer, MHWebb, ML Identification and hit-to-lead optimization of a novel class of CB1 antagonists. Bioorg Med Chem Lett20:5449-53 (2010) 
 
Cannabinoid receptor 1
Name:Cannabinoid receptor 1
Type:G Protein-Coupled Receptor (GPCR)
Mol. Mass.:52868.96
Organism:Homo sapiens (Human)
Description:P21554
Residue:472
BDBM50325884
NameBDBM50325884
Synonyms:CHEMBL1224458 | N-(1-(3-(benzo[d][1,3]dioxol-4-yl)benzyl)-1H-indol-6-yl)pivalamide
TypeSmall organic molecule
Emp. Form.C27H26N2O3
Mol. Mass.426.5069
SMILESCC(C)(C)C(=O)Nc1ccc2ccn(Cc3cccc(c3)-c3cccc4OCOc34)c2c1