Reaction Details
TargetHydroxycarboxylic acid receptor 2
LigandBDBM50325924
Substrate/Competitorn/a
Meas. Tech.ChEMBL_652722 (CHEMBL1225925)
IC50 50±n/a nM
Citation Peters, JUKühne, HDehmlow, HGrether, UConte, AHainzl, DHertel, CKratochwil, NAOtteneder, MNarquizian, RPanousis, CGRicklin, FRöver, S Pyrido pyrimidinones as selective agonists of the high affinity niacin receptor GPR109A: optimization of in vitro activity. Bioorg Med Chem Lett20:5426-30 (2010) 
 
Hydroxycarboxylic acid receptor 2
Name:Hydroxycarboxylic acid receptor 2
Type:G Protein-Coupled Receptor (GPCR)
Mol. Mass.:41868.22
Organism:Homo sapiens (Human)
Description:Membranes from CHO cells expressing the recombinant human GPR109A were used in competition binding assay.
Residue:363
BDBM50325924
NameBDBM50325924
Synonyms:2-((3-chlorophenethyloxy)methyl)pyrido[2,3-d]pyrimidin-4(3H)-one | CHEMBL1224219
TypeSmall organic molecule
Emp. Form.C16H14ClN3O2
Mol. Mass.315.754
SMILESClc1cccc(CCOCc2nc3ncccc3c(=O)[nH]2)c1