Reaction Details
TargetHydroxycarboxylic acid receptor 2
LigandBDBM50325922
Substrate/Competitorn/a
Meas. Tech.ChEMBL_654086 (CHEMBL1228892)
EC50 1600±n/a nM
Citation Peters, JUKühne, HDehmlow, HGrether, UConte, AHainzl, DHertel, CKratochwil, NAOtteneder, MNarquizian, RPanousis, CGRicklin, FRöver, S Pyrido pyrimidinones as selective agonists of the high affinity niacin receptor GPR109A: optimization of in vitro activity. Bioorg Med Chem Lett20:5426-30 (2010) 
 
Hydroxycarboxylic acid receptor 2
Name:Hydroxycarboxylic acid receptor 2
Type:PROTEIN
Mol. Mass.:41476.06
Organism:Rattus norvegicus
Description:ChEMBL_820675
Residue:360
BDBM50325922
NameBDBM50325922
Synonyms:2-((4-fluorophenethyloxy)methyl)pyrido[2,3-d]pyrimidin-4(3H)-one | CHEMBL1224147
TypeSmall organic molecule
Emp. Form.C16H14FN3O2
Mol. Mass.299.2997
SMILESFc1ccc(CCOCc2nc3ncccc3c(=O)[nH]2)cc1