Reaction Details
TargetMyosin light chain kinase, smooth muscle
LigandBDBM15234
Substrate/Competitorn/a
Meas. Tech.ChEMBL_660315 (CHEMBL1249811)
IC50 260±n/a nM
Citation Davies, SPReddy, HCaivano, MCohen, P Specificity and mechanism of action of some commonly used protein kinase inhibitors. Biochem J351:95-105 (2001) Myosin light chain kinase, smooth muscle
Name:Myosin light chain kinase, smooth muscle
Type:Enzyme
Mol. Mass.:210423.57
Organism:Gallus gallus (chicken)
Description:n/a
Residue:1906
BDBM15234
NameBDBM15234
Synonyms:(1R,3R,5S,9R,18S)-18-(methoxymethyl)-1,5-dimethyl-6,11,16-trioxo-13,17-dioxapentacyclo[10.6.1.0^{2,10}.0^{5,9}.0^{15,19}]nonadeca-2(10),12(19),14-trien-3-yl acetate NSC221019 Wortmannin, Wm | cid_312145
TypeAntibiotic
Emp. Form.C23H24O8
Mol. Mass.428.4319
SMILES[H][C@@]12CCC(=O)[C@@]1(C)C[C@@H](OC(C)=O)C1=C2C(=O)c2occ3c2[C@]1(C)[C@@H](COC)OC3=O