Reaction Details
TargetCyclin-dependent kinase 2
LigandBDBM50229961
Substrate/Competitorn/a
Meas. Tech.ChEMBL_660476 (CHEMBL1250106)
IC50 18000±n/a nM
Citation Saghatelian, ACravatt, BF Assignment of protein function in the postgenomic era. Nat Chem Biol1:130-42 (2006) 
 
Cyclin-dependent kinase 2
Name:Cyclin-dependent kinase 2
Type:Enzyme Subunit
Mol. Mass.:33938.17
Organism:Homo sapiens (Human)
Description:P24941
Residue:298
BDBM50229961
NameBDBM50229961
Synonyms:1-(1,1-dimethylethyl)-3-(1-naphthalenyl)-1H-pyrazolo[3,4-d]pyrimidin-4-amine 1-NA-PP1 1-tert-butyl-3-naphthalen-1-yl-1H-pyrazolo[3,4-d]pyrimidin-4-amine CHEMBL264406 US11247972, Compound 1 | US9765037, Compound 1
TypeSmall organic molecule
Emp. Form.C19H19N5
Mol. Mass.317.3877
SMILESCC(C)(C)n1nc(-c2cccc3ccccc23)c2c(N)ncnc12