Reaction Details
TargetTyrosine-protein kinase Fyn
LigandBDBM50298225
Substrate/Competitorn/a
Meas. Tech.ChEMBL_660473 (CHEMBL1250103)
IC50 1000±n/a nM
Citation Saghatelian, ACravatt, BF Assignment of protein function in the postgenomic era. Nat Chem Biol1:130-42 (2006) 
 
Tyrosine-protein kinase Fyn
Name:Tyrosine-protein kinase Fyn
Type:Enzyme
Mol. Mass.:60762.21
Organism:Homo sapiens (Human)
Description:P06241
Residue:537
BDBM50298225
NameBDBM50298225
Synonyms:CHEMBL2069955 NM-PP1 US11247972, Compound 5d | US9765037, Compound 5d
TypeSmall organic molecule
Emp. Form.C20H21N5
Mol. Mass.331.4142
SMILESCC(C)(C)n1nc(Cc2cccc3ccccc23)c2c(N)ncnc12