Reaction Details
TargetAurora kinase B
LigandBDBM50181532
Substrate/Competitorn/a
Meas. Tech.ChEMBL_660975 (CHEMBL1249642)
IC50 7±n/a nM
Citation Liu, YGray, NS Rational design of inhibitors that bind to inactive kinase conformations. Nat Chem Biol2:358-64 (2006) 
 
Aurora kinase B
Name:Aurora kinase B
Type:Protein
Mol. Mass.:39327.72
Organism:Homo sapiens (Human)
Description:Q96GD4
Residue:344
BDBM50181532
NameBDBM50181532
Synonyms:CHEMBL201307 N-(3-fluorophenyl)-2-{2-[(7-{3-[4-(hydroxymethyl)piperidin-1-yl]propoxy}-6-methoxyquinazolin-4-yl)amino]-1,3-thiazol-5-yl}acetamide | N-3-fluorophenyl)-2-2-7-3-4-hydroxymethyl)piperidin-1-yl)propoxy)-6-methoxyquinazolin-4-ylamino)thiazol-5-yl)acetamide
TypeSmall organic molecule
Emp. Form.C29H33FN6O4S
Mol. Mass.580.674
SMILESCOc1cc2c(Nc3ncc(CC(=O)Nc4cccc(F)c4)s3)ncnc2cc1OCCCN1CCC(CO)CC1