Reaction Details
TargetTyrosine-protein kinase ABL1
LigandBDBM13530
Substrate/Competitorn/a
Meas. Tech.ChEMBL_660972 (CHEMBL1249639)
Ki 7000±n/a nM
Citation Liu, YGray, NS Rational design of inhibitors that bind to inactive kinase conformations. Nat Chem Biol2:358-64 (2006) 
 
Tyrosine-protein kinase ABL1
Name:Tyrosine-protein kinase ABL1
Type:Enzyme
Mol. Mass.:122897.30
Organism:Homo sapiens (Human)
Description:P00519
Residue:1130
BDBM13530
NameBDBM13530
Synonyms:4-[(4-methylpiperazin-1-yl)methyl]-N-[4-methyl-3-[(4-pyridin-3-ylpyrimidin-2-yl)amino]phenyl]benzamide Gleevec Imatinib, 21 STI-571 US10906896, Cpd imatinib US11725005, Compound imatinib cid_5291 med.21724, Compound 6
TypeSmall organic molecule
Emp. Form.C29H31N7O
Mol. Mass.493.6027
SMILESCN1CCN(Cc2ccc(cc2)C(=O)Nc2ccc(C)c(Nc3nccc(n3)-c3cccnc3)c2)CC1