Reaction Details
TargetAngiopoietin-1 receptor
LigandBDBM8813
Substrate/Competitorn/a
Meas. Tech.ChEMBL_660987 (CHEMBL1249719)
IC50 110±n/a nM
Citation Liu, YGray, NS Rational design of inhibitors that bind to inactive kinase conformations. Nat Chem Biol2:358-64 (2006) 
 
Angiopoietin-1 receptor
Name:Angiopoietin-1 receptor
Type:Enzyme
Mol. Mass.:125835.70
Organism:Homo sapiens (Human)
Description:Q02763
Residue:1124
BDBM8813
NameBDBM8813
Synonyms:3-(4-{4-amino-6-methylthieno[2,3-d]pyrimidin-5-yl}phenyl)-1-(3-methylphenyl)urea CHEMBL537435 N-[4-(4-Amino-6-methylthieno[2,3-d]pyrimidin-5-yl)-phenyl]-N -(3-methylphenyl)urea | Thienopyrimidine deriv. 11
TypeSmall organic molecule
Emp. Form.C21H19N5OS
Mol. Mass.389.473
SMILESCc1sc2ncnc(N)c2c1-c1ccc(NC(=O)Nc2cccc(C)c2)cc1