Reaction Details
TargetInsulin receptor
LigandBDBM50326003
Substrate/Competitorn/a
Meas. Tech.ChEMBL_654586 (CHEMBL1243630)
IC50 2080±n/a nM
Citation Steiner, LBlum, GFriedmann, YLevitzki, A ATP non-competitive IGF-1 receptor kinase inhibitors as lead anti-neoplastic and anti-papilloma agents. Eur J Pharmacol562:1-11 (2007) 
 
Insulin receptor
Name:Insulin receptor
Type:Receptor Tyrosine Kinase
Mol. Mass.:156322.60
Organism:Homo sapiens (Human)
Description:P06213
Residue:1382
BDBM50326003
NameBDBM50326003
Synonyms:4-((benzo[d][1,3]dioxol-5-ylamino)methyl)benzene-1,2-diol | CHEMBL1240829
TypeSmall organic molecule
Emp. Form.C14H13NO4
Mol. Mass.259.2573
SMILESOc1ccc(CNc2ccc3OCOc3c2)cc1O