Reaction Details
TargetInsulin receptor
LigandBDBM50326007
Substrate/Competitorn/a
Meas. Tech.ChEMBL_654586 (CHEMBL1243630)
IC50 1600±n/a nM
Citation Steiner, LBlum, GFriedmann, YLevitzki, A ATP non-competitive IGF-1 receptor kinase inhibitors as lead anti-neoplastic and anti-papilloma agents. Eur J Pharmacol562:1-11 (2007) 
 
Insulin receptor
Name:Insulin receptor
Type:Receptor Tyrosine Kinase
Mol. Mass.:156322.60
Organism:Homo sapiens (Human)
Description:P06213
Residue:1382
BDBM50326007
NameBDBM50326007
Synonyms:4,4'-(naphthalen-2-ylazanediyl)bis(methylene)dibenzene-1,2-diol | CHEMBL1241670
TypeSmall organic molecule
Emp. Form.C24H21NO4
Mol. Mass.387.4278
SMILESOc1ccc(CN(Cc2ccc(O)c(O)c2)c2ccc3ccccc3c2)cc1O