Reaction Details
TargetUbiquitin carboxyl-terminal hydrolase isozyme L1
LigandBDBM50326014
Substrate/Competitorn/a
Meas. Tech.ChEMBL_654655 (CHEMBL1243699)
IC50 940±n/a nM
Citation Love, KRCatic, ASchlieker, CPloegh, HL Mechanisms, biology and inhibitors of deubiquitinating enzymes. Nat Chem Biol3:697-705 (2007) 
 
Ubiquitin carboxyl-terminal hydrolase isozyme L1
Name:Ubiquitin carboxyl-terminal hydrolase isozyme L1
Type:PROTEIN
Mol. Mass.:24819.03
Organism:Homo sapiens (Human)
Description:ChEMBL_974327
Residue:223
BDBM50326014
NameBDBM50326014
Synonyms:3-(acetoxyimino)-1-(3,4-dichlorobenzyl)-5-iodoindolin-2-one | CHEMBL1241765
TypeSmall organic molecule
Emp. Form.C17H11Cl2IN2O3
Mol. Mass.489.091
SMILESCC(=O)ON=C1C(=O)N(Cc2ccc(Cl)c(Cl)c2)c2ccc(I)cc12