Reaction Details
TargetUbiquitin carboxyl-terminal hydrolase isozyme L1
LigandBDBM50326015
Substrate/Competitorn/a
Meas. Tech.ChEMBL_654655 (CHEMBL1243699)
IC50 126000±n/a nM
Citation Love, KRCatic, ASchlieker, CPloegh, HL Mechanisms, biology and inhibitors of deubiquitinating enzymes. Nat Chem Biol3:697-705 (2007) 
 
Ubiquitin carboxyl-terminal hydrolase isozyme L1
Name:Ubiquitin carboxyl-terminal hydrolase isozyme L1
Type:PROTEIN
Mol. Mass.:24819.03
Organism:Homo sapiens (Human)
Description:ChEMBL_974327
Residue:223
BDBM50326015
NameBDBM50326015
Synonyms:5-(4-butylphenyl)-4-(4-isopropylphenyl)-4H-1,2,4-triazole-3-thiol | CHEMBL1241766
TypeSmall organic molecule
Emp. Form.C21H25N3S
Mol. Mass.351.508
SMILESCCCCc1ccc(cc1)-c1n[nH]c(=S)n1-c1ccc(cc1)C(C)C