Reaction Details
TargetHigh affinity nerve growth factor receptor
LigandBDBM4552
Substrate/Competitorn/a
Meas. Tech.ChEMBL_655547 (CHEMBL1244591)
IC50 22±n/a nM
Citation Remsing Rix, LLRix, UColinge, JHantschel, OBennett, KLStranzl, TMüller, ABaumgartner, CValent, PAugustin, MTill, JHSuperti-Furga, G Global target profile of the kinase inhibitor bosutinib in primary chronic myeloid leukemia cells. Leukemia23:477-85 (2009) 
 
High affinity nerve growth factor receptor
Name:High affinity nerve growth factor receptor
Type:n/a
Mol. Mass.:87498.18
Organism:Homo sapiens (Human)
Description:P04629
Residue:796
BDBM4552
NameBDBM4552
Synonyms:4-[(2,4-Dichloro-5-methoxyphenyl)amino]-6-methoxy-7-[3-(4-methyl-1-piperazinyl)propoxy]-3-quinolinecarbonitrile BOSUTINIB SKI-606
TypeSmall organic molecule
Emp. Form.C26H29Cl2N5O3
Mol. Mass.530.446
SMILESCOc1cc(Nc2c(cnc3cc(OCCCN4CCN(C)CC4)c(OC)cc23)C#N)c(Cl)cc1Cl