Reaction Details
TargetCathepsin G
LigandBDBM50326027
Substrate/Competitorn/a
Meas. Tech.ChEMBL_655591 (CHEMBL1244635)
IC50 150±n/a nM
Citation Heinis, CRutherford, TFreund, SWinter, G Phage-encoded combinatorial chemical libraries based on bicyclic peptides. Nat Chem Biol5:502-7 (2009) 
 
Cathepsin G
Name:Cathepsin G
Type:PROTEIN
Mol. Mass.:28860.08
Organism:Homo sapiens (Human)
Description:ChEMBL_1469016
Residue:255
BDBM50326027
NameBDBM50326027
Synonyms:CHEMBL1240612
TypeSmall organic molecule
Emp. Form.C77H106N18O21S3
Mol. Mass.1715.969
SMILESCC(C)C[C@@H]1NC(=O)[C@H](CC(O)=O)NC(=O)[C@H](Cc2ccccc2)NC(=O)[C@H](CC(C)C)NC(=O)[C@H](CSCc2cc3CSC[C@H](NC(=O)[C@@H]4CCCN4C(=O)CNC(=O)[C@H](CCC(O)=O)NC(=O)CNC(=O)CNC(=O)CNC(=O)[C@H](CSCc(c3)c2)NC(=O)[C@H](Cc2ccccc2)NC(=O)CNC1=O)C(=O)NCC(N)=O)NC(=O)[C@H](C)N