Reaction Details
TargetUrokinase-type plasminogen activator
LigandBDBM50326049
Substrate/Competitorn/a
Meas. Tech.ChEMBL_655599 (CHEMBL1244643)
Ki 400±n/a nM
Citation Heinis, CRutherford, TFreund, SWinter, G Phage-encoded combinatorial chemical libraries based on bicyclic peptides. Nat Chem Biol5:502-7 (2009) 
 
Urokinase-type plasminogen activator
Name:Urokinase-type plasminogen activator
Type:Enzyme
Mol. Mass.:48528.62
Organism:Homo sapiens (Human)
Description:P00749
Residue:431
BDBM50326049
NameBDBM50326049
Synonyms:(3S,6S,9S,12S,15S,18S,21S,24R)-1-((S)-1-((R)-2-amino-3-mercaptopropanoyl)pyrrolidin-2-yl)-21-(carboxymethyl)-12-(3-guanidinopropyl)-6,15-bis(4-hydroxybenzyl)-9-(hydroxymethyl)-18-isobutyl-24-(mercaptomethyl)-3-methyl-1,4,7,10,13,16,19,22-octaoxo-2,5,8,11,14,17,20,23-octaazapentacosan-25-oic acid | CHEMBL1240679
TypeSmall organic molecule
Emp. Form.C51H75N13O16S2
Mol. Mass.1190.349
SMILES[#6]-[#6](-[#6])-[#6]-[#6@H](-[#7]-[#6](=O)-[#6@H](-[#6]-c1ccc(-[#8])cc1)-[#7]-[#6](=O)-[#6@H](-[#6]-[#6]-[#6]\[#7]=[#6](/[#7])-[#7])-[#7]-[#6](=O)-[#6@H](-[#6]-[#8])-[#7]-[#6](=O)-[#6@H](-[#6]-c1ccc(-[#8])cc1)-[#7]-[#6](=O)-[#6@H](-[#6])-[#7]-[#6](=O)-[#6@@H]-1-[#6]-[#6]-[#6]-[#7]-1-[#6](=O)-[#6@@H](-[#7])-[#6]-[#16])-[#6](=O)-[#7]-[#6@@H](-[#6]-[#6](-[#8])=O)-[#6](=O)-[#7]-[#6@@H](-[#6]-[#16])-[#6](-[#8])=O