Reaction Details
TargetCathepsin G
LigandBDBM50326025
Substrate/Competitorn/a
Meas. Tech.ChEMBL_655591 (CHEMBL1244635)
IC50 200±n/a nM
Citation Heinis, CRutherford, TFreund, SWinter, G Phage-encoded combinatorial chemical libraries based on bicyclic peptides. Nat Chem Biol5:502-7 (2009) 
 
Cathepsin G
Name:Cathepsin G
Type:PROTEIN
Mol. Mass.:28860.08
Organism:Homo sapiens (Human)
Description:ChEMBL_1469016
Residue:255
BDBM50326025
NameBDBM50326025
Synonyms:CHEMBL1240614
TypeSmall organic molecule
Emp. Form.C87H127N25O25S3
Mol. Mass.2019.287
SMILES[#6]-[#6](-[#6])-[#6]-[#6@@H]-1-[#7]-[#6](=O)-[#6@H](-[#6]-[#16]-[#6]-c2cc3-[#6]-[#16]-[#6]-[#6@H](-[#7]-[#6](=O)-[#6@H](-[#6]-c4ccccc4)-[#7]-[#6](=O)-[#6]-[#7]-[#6](=O)-[#6@H](-[#6]-[#6]-[#6]\[#7]=[#6](\[#7])-[#7])-[#7]-[#6](=O)-[#6@H](-[#6]-[#6](-[#8])=O)-[#7]-[#6](=O)-[#6@H](-[#6]-c4ccc(-[#8])cc4)-[#7]-[#6](=O)-[#6@H](-[#7]-[#6](=O)-[#6@H](-[#6]-[#16]-[#6]-c(c3)c2)-[#7]-[#6](=O)-[#6@H](-[#6]-[#6](-[#8])=O)-[#7]-[#6](=O)-[#6@H](-[#6]-[#6]-[#6](-[#8])=O)-[#7]-[#6](=O)-[#6@H](-[#6]-[#6]-[#6](-[#7])=O)-[#7]-[#6](=O)-[#6@H](-[#6])-[#7]-[#6](=O)-[#6@H](-[#6]-[#6]-[#6]\[#7]=[#6](\[#7])-[#7])-[#7]-[#6]-1=O)-[#6](-[#6])-[#6])-[#6](=O)-[#7]-[#6]-[#6](-[#7])=O)-[#7]-[#6](=O)-[#6@H](-[#6])-[#7]