Reaction Details
TargetcAMP-dependent protein kinase catalytic subunit PRKX
LigandBDBM50326053
Substrate/Competitorn/a
Meas. Tech.ChEMBL_655902 (CHEMBL1244946)
Kd 960±n/a nM
Citation Zarrinkar, PPGunawardane, RNCramer, MDGardner, MFBrigham, DBelli, BKaraman, MWPratz, KWPallares, GChao, QSprankle, KGPatel, HKLevis, MArmstrong, RCJames, JBhagwat, SS AC220 is a uniquely potent and selective inhibitor of FLT3 for the treatment of acute myeloid leukemia (AML). Blood114:2984-92 (2009) 
 
cAMP-dependent protein kinase catalytic subunit PRKX
Name:cAMP-dependent protein kinase catalytic subunit PRKX
Type:Enzyme Catalytic Domain
Mol. Mass.:40897.91
Organism:Homo sapiens (Human)
Description:gi_4826948
Residue:358
BDBM50326053
NameBDBM50326053
Synonyms:CHEMBL608533 | PKC-412
TypeSmall organic molecule
Emp. Form.C35H30N4O4
Mol. Mass.570.6371
SMILESCO[C@@H]1[C@@H](C[C@H]2O[C@]1(C)n1c3ccccc3c3c4CNC(=O)c4c4c5ccccc5n2c4c13)N(C)C(=O)c1ccccc1