Reaction Details
TargetSerine/threonine-protein kinase MARK1
LigandBDBM50326053
Substrate/Competitorn/a
Meas. Tech.ChEMBL_655456 (CHEMBL1244500)
Kd 170±n/a nM
Citation Zarrinkar, PPGunawardane, RNCramer, MDGardner, MFBrigham, DBelli, BKaraman, MWPratz, KWPallares, GChao, QSprankle, KGPatel, HKLevis, MArmstrong, RCJames, JBhagwat, SS AC220 is a uniquely potent and selective inhibitor of FLT3 for the treatment of acute myeloid leukemia (AML). Blood114:2984-92 (2009) 
 
Serine/threonine-protein kinase MARK1
Name:Serine/threonine-protein kinase MARK1
Type:Enzyme
Mol. Mass.:89034.85
Organism:Homo sapiens (Human)
Description:Q9P0L2
Residue:795
BDBM50326053
NameBDBM50326053
Synonyms:CHEMBL608533 | PKC-412
TypeSmall organic molecule
Emp. Form.C35H30N4O4
Mol. Mass.570.6371
SMILESCO[C@@H]1[C@@H](C[C@H]2O[C@]1(C)n1c3ccccc3c3c4CNC(=O)c4c4c5ccccc5n2c4c13)N(C)C(=O)c1ccccc1