Reaction Details
TargetMAP kinase-activated protein kinase 5
LigandBDBM4814
Substrate/Competitorn/a
Meas. Tech.ChEMBL_655455 (CHEMBL1244499)
Kd>10000±n/a nM
Citation Zarrinkar, PPGunawardane, RNCramer, MDGardner, MFBrigham, DBelli, BKaraman, MWPratz, KWPallares, GChao, QSprankle, KGPatel, HKLevis, MArmstrong, RCJames, JBhagwat, SS AC220 is a uniquely potent and selective inhibitor of FLT3 for the treatment of acute myeloid leukemia (AML). Blood114:2984-92 (2009) 
 
MAP kinase-activated protein kinase 5
Name:MAP kinase-activated protein kinase 5
Type:Serine/threonine-protein kinase
Mol. Mass.:54229.92
Organism:Homo sapiens (Human)
Description:Recombinant MAPKAPK5 was phosphorylated by incubation with active p38alpha before assays.
Residue:473
BDBM4814
NameBDBM4814
Synonyms:CHEMBL535 N-[2-(diethylamino)ethyl]-5-{[(3Z)-5-fluoro-2-oxo-2,3-dihydro-1H-indol-3-ylidene]methyl}-2,4-dimethyl-1H-pyrrole-3-carboxamide SUNITINIB US10464902, Sunitinib US9914707, SU11248
TypeSmall organic molecule
Emp. Form.C22H27FN4O2
Mol. Mass.398.4738
SMILESCCN(CC)CCNC(=O)c1c(C)[nH]c(\C=C2/C(=O)Nc3ccc(F)cc23)c1C